{"text_format":"1","workbook":"xlsx","n_sheets":6,"sheets":["Check","Power point","Exp_Co (YTD)","Exp_private (YTD)","Exp_Co (MTM)","Exp_private (MTM)"],"not_rendered":{"charts":0,"images":2,"macros":1,"external_links":0,"defined_names":8,"comments":3,"pivot_tables":0},"unopened":[],"bounds":{"document_bytes":16777216,"sheet_cells":100000,"rows_first":2000,"rows_last":500,"rows_between":2000,"halvings":0,"cell_chars":16384,"cell_head_chars":4096},"cells_cut":0,"cells_raw":0,"read":"whole","date_system":"1900"}

{"sheet":"Check","index":0,"n_rows":128,"n_cols":30,"rows_kept":128,"cut":false,"hidden":false,"merged":[]}
[null,null,null,"PP1","C_PP1","PP2","C_PP2","PP3","C_PP3","PP4","C_PP4","PP5","C_PP5","PP6","C_P6","PP7","C_PP7","PP8","Check1","Check2","PP9","C_PP9","PP10","C_PP10","PP11","C_PP11","PP12","C_PP12","PP13","C_PP13"]
[null,null,null,null,{"$f":"IF(COUNTIF(E2:E999,\"FAIL\") > 0,\"FAIL\",\"OK\")","v":"OK"},null,{"$f":"IF(COUNTIF(G2:G999,\"FAIL\") > 0,\"FAIL\",\"OK\")","v":"OK"},null,{"$f":"IF(COUNTIF(I2:I999,\"FAIL\") > 0,\"FAIL\",\"OK\")","v":"OK"},null,{"$f":"IF(COUNTIF(K2:K999,\"FAIL\") > 0,\"FAIL\",\"OK\")","v":"OK"},null,{"$f":"IF(COUNTIF(M2:M999,\"FAIL\") > 0,\"FAIL\",\"OK\")","v":"OK"},null,{"$f":"IF(COUNTIF(O2:O999,\"FAIL\") > 0,\"FAIL\",\"OK\")","v":"OK"},null,{"$f":"IF(COUNTIF(Q2:Q999,\"FAIL\") > 0,\"FAIL\",\"OK\")","v":"OK"},null,{"$f":"IF(COUNTIF(S2:S27,\"FAIL\")>0,\"FAIL\",\"OK\")","v":"FAIL"},{"$f":"IF(COUNTIF(T18:T20,\"FAIL\")>0,\"FAIL\",\"OK\")","v":"OK"}]
["PP1",{"$f":"E2","v":"OK"},null,"(HK$’000)",null,"(HK$’000)",null,"(HK$’000)",null,"(HK$’000)",null,"(HK$’000)",null,"(HK$’000)",null,null,null,"序號"]
["PP2",{"$f":"G2","v":"OK"},null,"(HK$’000)",null,"(HK$’000)",null,"與上月比較",null,"(HK$’000)",null,"與上月比較",null,"(HK$’000)",null,"回報率",null,"物業"]
["PP3",{"$f":"I2","v":"OK"},null,"與上月比較",null,"與上月比較",null,"與上月比較",null,"與上月比較",null,"與上月比較",null,"與上月比較",null,"出租率 (%)",null,"銀行"]
["PP4",{"$f":"K2","v":"OK"},null,"與上月比較",null,"與上月比較",null,"+/(-)",null,"與上月比較",null,"+/(-)",null,"與上月比較",null,"出租率 (%)",null,"最後   供款日"]
["PP5",{"$f":"M2","v":"OK"},null,"+/(-)",null,"+/(-)",null,null,null,"+/(-)",null,null,null,"+/(-)",null,null,null,"利率"]
["PP6",{"$f":"O2","v":"OK"},null,null,null,null,null,"2022年12月",null,null,null,"2022年12月",null,null,null,"12月",null," 每月\r租金\rHK$’000"]
["PP7",{"$f":"Q2","v":"OK"},null,"年度止",null,"年度止",null,"2022年11月",null,null,null,"2022年11月",null,null,null,"2022年12月",null," 每月\r供款\rHK$’000"]
["PP8",{"$f":"S2","v":"FAIL"},null,"年度止",null,"年度止",null,"%",null,"2022年12月",null,"%",null,"2022年12月",null,"2021年12月",null,"12月\r餘額/\r(差額)\rHK$’000"]
{"$rows_left_out":119}
{"sheet":"Power point","index":1,"n_rows":412,"n_cols":30,"rows_kept":412,"cut":false,"hidden":false,"merged":[[401,15,402,15],[401,16,402,16],[401,17,402,17],[403,9,404,9],[403,11,404,11],[403,12,404,12],[403,13,404,13],[403,14,404,14],[403,15,404,15],[403,16,404,16],[403,17,404,17],[401,9,402,9],[401,11,402,11],[401,12,402,12],[401,13,402,13],[401,14,402,14],[397,9,400,9],[397,10,400,10],[397,11,400,11],[397,12,400,12],[397,13,400,13],[8,8,9,8],[37,0,37,1],[32,0,32,1],[33,0,33,1],[34,0,34,1],[35,0,35,1],[36,0,36,1],[16,0,16,1],[10,0,10,1],[11,0,11,1],[12,0,12,1],[15,0,15,1],[13,0,13,1],[14,0,14,1],[18,0,19,0],[18,1,18,8],[7,2,7,3],[7,5,9,5],[7,6,7,7],[8,0,9,1],[8,4,9,4],[7,0,7,1],[19,1,19,8],[20,1,20,8],[117,2,117,3],[27,5,29,5],[27,6,27,7],[28,0,29,1],[28,4,29,4],[103,0,103,1],[104,0,104,1],[27,0,27,1],[27,2,27,3],[102,0,102,1],[78,1,78,2],[100,0,100,1],[100,2,100,3],[107,0,107,1],[28,8,29,8],[30,0,30,1],[31,0,31,1],[60,0,60,1],[74,0,74,1],[72,0,72,1],[73,0,73,1],[38,0,38,1],[39,1,39,8],[47,1,47,2],[70,0,70,1],[70,2,70,3],[71,0,71,1],[105,0,105,1],[40,1,40,8],[41,1,41,8],[42,1,42,8],[101,0,101,1],[106,0,106,1],[108,1,108,4],[109,1,109,4],[110,1,110,4],[111,1,111,4]]}
["replaceInSlide7R407:R407",null,null,null,null,null,null,null,null,null,"B","C","D","E","F","G","H",null,null,null,null,"B","C","D","E","F","G","H"]
[]
[]
[]
[null,null,{"$f":"'Exp_Co (MTM)'!O5","v":"12月"},{"$f":"'Exp_Co (MTM)'!R5","v":"11月"},null,null,null,null,null,null,null,{"$f":"'Exp_Co (MTM)'!O5","v":"12月"},{"$f":"'Exp_Co (MTM)'!R5","v":"11月"}]
["PP2",null,"V>S>O","Y>V>R",null,null,null,null,null,null,null,"V>S>O","Y>V>R",null,null,"column unchange","column unchange"]
["2022年12月份營運收支表",null,null,null,null,null,"column unchange","OK"]
["(HK$’000)",null,"與上月比較",null,"+/(-)",null,"年度止",null,"+/(-)"]
[null,null,"2022年","2022年","%",null,"2022年","2021年","%"]
[null,null,"12月","11月",null,null,"4-12月","4-12月"]
{"$rows_left_out":403}
{"sheet":"Exp_Co (YTD)","index":2,"n_rows":45,"n_cols":38,"rows_kept":45,"cut":false,"hidden":false,"merged":[[5,35,5,36]]}
["2022年12月份營運支出 - 公司"]
["與上年比較"]
[]
[null,null,null,null,null,null,null,null,null,null,null,null,null,null,null,null,null,"4/2022-3/2023",null,null,null,null,null,null,null,null,null,null,null,null,null,null,"4/2021-3/2022"]
[null,null,null,null,null,null,null,null,null,null,null,null,null,null,null,null,null,"YTD",null,null,null,null,null,null,null,null,null,null,null,null,null,null,"YTD"]
[null,null,null,null,"2022-04-01","2022-05-01","2022-06-01","2022-07-01","2022-08-01","2022-09-01","2022-10-01","2022-11-01","2022-12-01","2023-01-01","2023-02-01","2023-03-01",null,"2022-12-01",null,"2021-04-01","2021-05-01","2021-06-01","2021-07-01","2021-08-01","2021-09-01","2021-10-01","2021-11-01","2021-12-01","2022-01-01","2022-02-01","2022-03-01",null,"2021-12-01",null,null,"增/(減)",null,"附錄"]
[null,null,"附註",null,null,null,null,null,null,null,null,null,null,null,null,null,null,"HK$'000",null,null,null,null,null,null,null,null,null,null,null,null,null,null,"HK$'000",null,null,"HK$'000","%"]
[null,"Income A",null,null,1000,1000,1000,1000,1000,1000,1000,990000,900000,null,null,null,null,{"$f":"ROUND(SUM(E8:Q8)/1000,0)","v":1897},null,1000,1000,1000,1000,1000,1000,1000,1000,1000,1000,1000,1000,null,{"$f":"ROUND(SUM(T8:AB8)/1000,0)","v":9},null,null,{"$f":"R8-AG8","v":1888},{"$f":"IF(AG8=0,IF(R8=0,\"N/A\",\"100%\"),AJ8/AG8)","v":209.77777777777777}]
[null,"Income B",null,null,1000,1000,1000,1000,1000,1000,1000,1100000,1000000,null,null,null,null,{"$f":"ROUND(SUM(E9:Q9)/1000,0)","v":2107},null,1000,1000,1000,1000,1000,1000,1000,1000,1000,1000,1000,1000,null,{"$f":"ROUND(SUM(T9:AB9)/1000,0)","v":9},null,null,{"$f":"R9-AG9","v":2098},{"$f":"IF(AG9=0,IF(R9=0,\"N/A\",\"100%\"),AJ9/AG9)","v":233.11111111111111}]
[null,"Income C",null,null,1000,1000,1000,1000,1000,1000,1000,1000,1000,null,null,null,null,{"$f":"ROUND(SUM(E10:Q10)/1000,0)","v":9},null,1000,1000,1000,1000,1000,1000,1000,1000,1000,1000,1000,1000,null,{"$f":"ROUND(SUM(T10:AB10)/1000,0)","v":9},null,null,0,0]
{"$rows_left_out":36}
{"sheet":"Exp_private (YTD)","index":3,"n_rows":31,"n_cols":40,"rows_kept":31,"cut":false,"hidden":false,"merged":[[4,35,4,36]]}
["2022年12月份收入及付款記錄 - 個人"]
["與上年比較"]
[]
[null,null,null,null,null,null,null,null,null,null,null,null,null,null,null,null,null,"YTD",null,null,null,null,null,null,null,null,null,null,null,null,null,null,"YTD"]
[null,null,null,null,"2022-04-01","2022-05-01","2022-06-01","2022-07-01","2022-08-01","2022-09-01","2022-10-01","2022-11-01","2022-12-01","2023-01-01","2023-02-01","2023-03-01",null,"2022-12-01",null,"2021-04-01","2021-05-01","2021-06-01","2021-07-01","2021-08-01","2021-09-01","2021-10-01","2021-11-01","2021-12-01","2022-01-01","2022-02-01","2022-03-01",null,"2021-12-01",null,null,"增/(減)"]
[null,null,"附註",null,null,null,null,null,null,null,null,null,null,null,null,null,null,"HK$'000",null,null,null,null,null,null,null,null,null,null,null,null,null,null,"HK$'000",null,null,"HK$'000","%"]
[]
[null,"Private income A",null,null,1000,1000,1000,1000,1000,1000,1000,1200000,990000,null,null,null,null,{"$f":"ROUND(SUM(E8:Q8)/1000,0)","v":2197},null,1000,1000,1000,1000,1000,1000,1000,1000,1000,1000,1000,1000,null,{"$f":"ROUND(SUM(T8:AB8)/1000,0)","v":9},null,null,{"$f":"R8-AG8","v":2188},{"$f":"IF(AG8=0,IF(R8=0,\"N/A\",\"100%\"),AJ8/AG8)","v":243.11111111111111}]
[null,"Private income B",null,null,1000,1000,1000,1000,1000,1000,1000,1000,1000,null,null,null,null,9,null,1000,1000,1000,1000,1000,1000,1000,1000,1000,1000,1000,1000,null,{"$f":"ROUND(SUM(T9:AB9)/1000,0)","v":9},null,null,{"$f":"R9-AG9","v":0},{"$f":"IF(AG9=0,IF(R9=0,\"N/A\",\"100%\"),AJ9/AG9)","v":0}]
[null,"Private income C",null,null,1000,1000,1000,1000,1000,1000,1000,1000,1000,null,null,null,null,9,null,1000,1000,1000,1000,1000,1000,1000,1000,1000,1000,1000,1000,null,{"$f":"ROUND(SUM(T10:AB10)/1000,0)","v":9},null,null,0,0]
{"$rows_left_out":22}
{"sheet":"Exp_Co (MTM)","index":4,"n_rows":46,"n_cols":48,"rows_kept":46,"cut":false,"hidden":false,"merged":[[4,43,4,44]]}
["2022年12月份營運支出 - 公司"]
["與上月比較"]
[]
[]
[null,"MONTH",null,null,null,"3月",null,null,"2月",null,null,"1月",null,null,"12月",null,null,"11月",null,null,"10月",null,null,"9月",null,null,"8月",null,null,"7月",null,null,"6月",null,null,"5月",null,null,"4月",null,null,"3月",null,"增/(減)",null,"附錄"]
[null,null,"附註",null,null,"HK$'000",null,null,"HK$'000",null,null,"HK$'000",null,null,"HK$'000",null,null,"HK$'000",null,null,"HK$'000",null,null,"HK$'000",null,null,"HK$'000",null,null,"HK$'000",null,null,"HK$'000",null,null,"HK$'000",null,null,"HK$'000",null,null,"HK$'000",null,"HK$'000","%"]
[null,"Income A",null,null,{"$f":"VLOOKUP($B7,'Exp_Co (YTD)'!$B$8:$AI$43,15,FALSE)","v":0},{"$f":"ROUND(E7/1000,0)","v":0},null,{"$f":"VLOOKUP($B7,'Exp_Co (YTD)'!$B$8:$AI$43,14,FALSE)","v":0},{"$f":"ROUND(H7/1000,0)","v":0},null,{"$f":"VLOOKUP($B7,'Exp_Co (YTD)'!$B$8:$AI$43,13,FALSE)","v":0},{"$f":"ROUND(K7/1000,0)","v":0},null,{"$f":"VLOOKUP($B7,'Exp_Co (YTD)'!$B$8:$AI$43,12,FALSE)","v":900000},{"$f":"ROUND(N7/1000,0)","v":900},null,{"$f":"VLOOKUP($B7,'Exp_Co (YTD)'!$B$8:$AI$43,11,FALSE)","v":990000},{"$f":"ROUND(Q7/1000,0)","v":990},null,{"$f":"VLOOKUP($B7,'Exp_Co (YTD)'!$B$8:$AI$43,10,FALSE)","v":1000},{"$f":"ROUND(T7/1000,0)","v":1},null,{"$f":"VLOOKUP($B7,'Exp_Co (YTD)'!$B$8:$AI$43,9,FALSE)","v":1000},{"$f":"ROUND(W7/1000,0)","v":1},null,{"$f":"VLOOKUP($B7,'Exp_Co (YTD)'!$B$8:$AI$43,8,FALSE)","v":1000},{"$f":"ROUND(Z7/1000,0)","v":1},null,{"$f":"VLOOKUP($B7,'Exp_Co (YTD)'!$B$8:$AI$43,7,FALSE)","v":1000},{"$f":"ROUND(AC7/1000,0)","v":1},null,{"$f":"VLOOKUP($B7,'Exp_Co (YTD)'!$B$8:$AI$43,6,FALSE)","v":1000},{"$f":"ROUND(AF7/1000,0)","v":1},null,{"$f":"VLOOKUP($B7,'Exp_Co (YTD)'!$B$8:$AI$43,5,FALSE)","v":1000},{"$f":"ROUND(AI7/1000,0)","v":1},null,{"$f":"VLOOKUP($B7,'Exp_Co (YTD)'!$B$8:$AI$43,4,FALSE)","v":1000},{"$f":"ROUND(AL7/1000,0)","v":1},null,{"$f":"VLOOKUP(B7,'Exp_Co (YTD)'!$B$8:$AI$43,30,FALSE)","v":1000},{"$f":"ROUND(AO7/1000,0)","v":1},null,{"$f":"O7-R7","v":-90},{"$f":"IF(R7=0,IF(O7=0,\"N/A\",\"100%\"),AR7/R7)","v":-9.0909090909090912E-2}]
[null,"Income B",null,null,{"$f":"VLOOKUP($B8,'Exp_Co (YTD)'!$B$8:$AI$43,15,FALSE)","v":0},{"$f":"ROUND(E8/1000,0)","v":0},null,{"$f":"VLOOKUP($B8,'Exp_Co (YTD)'!$B$8:$AI$43,14,FALSE)","v":0},{"$f":"ROUND(H8/1000,0)","v":0},null,{"$f":"VLOOKUP($B8,'Exp_Co (YTD)'!$B$8:$AI$43,13,FALSE)","v":0},{"$f":"ROUND(K8/1000,0)","v":0},null,{"$f":"VLOOKUP($B8,'Exp_Co (YTD)'!$B$8:$AI$43,12,FALSE)","v":1000000},{"$f":"ROUND(N8/1000,0)","v":1000},null,{"$f":"VLOOKUP($B8,'Exp_Co (YTD)'!$B$8:$AI$43,11,FALSE)","v":1100000},{"$f":"ROUND(Q8/1000,0)","v":1100},null,{"$f":"VLOOKUP($B8,'Exp_Co (YTD)'!$B$8:$AI$43,10,FALSE)","v":1000},{"$f":"ROUND(T8/1000,0)","v":1},null,{"$f":"VLOOKUP($B8,'Exp_Co (YTD)'!$B$8:$AI$43,9,FALSE)","v":1000},{"$f":"ROUND(W8/1000,0)","v":1},null,{"$f":"VLOOKUP($B8,'Exp_Co (YTD)'!$B$8:$AI$43,8,FALSE)","v":1000},{"$f":"ROUND(Z8/1000,0)","v":1},null,{"$f":"VLOOKUP($B8,'Exp_Co (YTD)'!$B$8:$AI$43,7,FALSE)","v":1000},{"$f":"ROUND(AC8/1000,0)","v":1},null,{"$f":"VLOOKUP($B8,'Exp_Co (YTD)'!$B$8:$AI$43,6,FALSE)","v":1000},{"$f":"ROUND(AF8/1000,0)","v":1},null,{"$f":"VLOOKUP($B8,'Exp_Co (YTD)'!$B$8:$AI$43,5,FALSE)","v":1000},{"$f":"ROUND(AI8/1000,0)","v":1},null,{"$f":"VLOOKUP($B8,'Exp_Co (YTD)'!$B$8:$AI$43,4,FALSE)","v":1000},{"$f":"ROUND(AL8/1000,0)-1","v":0},null,{"$f":"VLOOKUP(B8,'Exp_Co (YTD)'!$B$8:$AI$43,30,FALSE)","v":1000},{"$f":"ROUND(AO8/1000,0)","v":1},null,-100,-9.0909090909090912E-2]
[null,"Income C",null,null,{"$f":"VLOOKUP($B9,'Exp_Co (YTD)'!$B$8:$AI$43,15,FALSE)","v":0},{"$f":"ROUND(E9/1000,0)","v":0},null,{"$f":"VLOOKUP($B9,'Exp_Co (YTD)'!$B$8:$AI$43,14,FALSE)","v":0},{"$f":"ROUND(H9/1000,0)","v":0},null,{"$f":"VLOOKUP($B9,'Exp_Co (YTD)'!$B$8:$AI$43,13,FALSE)","v":0},{"$f":"ROUND(K9/1000,0)","v":0},null,{"$f":"VLOOKUP($B9,'Exp_Co (YTD)'!$B$8:$AI$43,12,FALSE)","v":1000},{"$f":"ROUND(N9/1000,0)","v":1},null,{"$f":"VLOOKUP($B9,'Exp_Co (YTD)'!$B$8:$AI$43,11,FALSE)","v":1000},{"$f":"ROUND(Q9/1000,0)","v":1},null,{"$f":"VLOOKUP($B9,'Exp_Co (YTD)'!$B$8:$AI$43,10,FALSE)","v":1000},{"$f":"ROUND(T9/1000,0)","v":1},null,{"$f":"VLOOKUP($B9,'Exp_Co (YTD)'!$B$8:$AI$43,9,FALSE)","v":1000},{"$f":"ROUND(W9/1000,0)","v":1},null,{"$f":"VLOOKUP($B9,'Exp_Co (YTD)'!$B$8:$AI$43,8,FALSE)","v":1000},{"$f":"ROUND(Z9/1000,0)","v":1},null,{"$f":"VLOOKUP($B9,'Exp_Co (YTD)'!$B$8:$AI$43,7,FALSE)","v":1000},{"$f":"ROUND(AC9/1000,0)","v":1},null,{"$f":"VLOOKUP($B9,'Exp_Co (YTD)'!$B$8:$AI$43,6,FALSE)","v":1000},{"$f":"ROUND(AF9/1000,0)","v":1},null,{"$f":"VLOOKUP($B9,'Exp_Co (YTD)'!$B$8:$AI$43,5,FALSE)","v":1000},{"$f":"ROUND(AI9/1000,0)","v":1},null,{"$f":"VLOOKUP($B9,'Exp_Co (YTD)'!$B$8:$AI$43,4,FALSE)","v":1000},{"$f":"ROUND(AL9/1000,0)","v":1},null,{"$f":"VLOOKUP(B9,'Exp_Co (YTD)'!$B$8:$AI$43,30,FALSE)","v":1000},{"$f":"ROUND(AO9/1000,0)","v":1},null,0,0]
[null,"Income D",null,null,{"$f":"VLOOKUP($B10,'Exp_Co (YTD)'!$B$8:$AI$43,15,FALSE)","v":0},{"$f":"ROUND(E10/1000,0)","v":0},null,{"$f":"VLOOKUP($B10,'Exp_Co (YTD)'!$B$8:$AI$43,14,FALSE)","v":0},{"$f":"ROUND(H10/1000,0)","v":0},null,{"$f":"VLOOKUP($B10,'Exp_Co (YTD)'!$B$8:$AI$43,13,FALSE)","v":0},{"$f":"ROUND(K10/1000,0)","v":0},null,{"$f":"VLOOKUP($B10,'Exp_Co (YTD)'!$B$8:$AI$43,12,FALSE)","v":1000},{"$f":"ROUND(N10/1000,0)","v":1},null,{"$f":"VLOOKUP($B10,'Exp_Co (YTD)'!$B$8:$AI$43,11,FALSE)","v":1000},{"$f":"ROUND(Q10/1000,0)","v":1},null,{"$f":"VLOOKUP($B10,'Exp_Co (YTD)'!$B$8:$AI$43,10,FALSE)","v":1000},{"$f":"ROUND(T10/1000,0)","v":1},null,{"$f":"VLOOKUP($B10,'Exp_Co (YTD)'!$B$8:$AI$43,9,FALSE)","v":1000},{"$f":"ROUND(W10/1000,0)","v":1},null,{"$f":"VLOOKUP($B10,'Exp_Co (YTD)'!$B$8:$AI$43,8,FALSE)","v":1000},{"$f":"ROUND(Z10/1000,0)","v":1},null,{"$f":"VLOOKUP($B10,'Exp_Co (YTD)'!$B$8:$AI$43,7,FALSE)","v":1000},{"$f":"ROUND(AC10/1000,0)","v":1},null,{"$f":"VLOOKUP($B10,'Exp_Co (YTD)'!$B$8:$AI$43,6,FALSE)","v":1000},{"$f":"ROUND(AF10/1000,0)+1","v":2},null,{"$f":"VLOOKUP($B10,'Exp_Co (YTD)'!$B$8:$AI$43,5,FALSE)","v":1000},{"$f":"ROUND(AI10/1000,0)","v":1},null,{"$f":"VLOOKUP($B10,'Exp_Co (YTD)'!$B$8:$AI$43,4,FALSE)","v":1000},{"$f":"ROUND(AL10/1000,0)","v":1},null,{"$f":"VLOOKUP(B10,'Exp_Co (YTD)'!$B$8:$AI$43,30,FALSE)","v":1000},{"$f":"ROUND(AO10/1000,0)","v":1},null,0,0]
{"$rows_left_out":37}
{"sheet":"Exp_private (MTM)","index":5,"n_rows":32,"n_cols":45,"rows_kept":32,"cut":false,"hidden":false,"merged":[[4,43,4,44]]}
["2022年12月份收入及付款記錄 - 個人"]
["與上月比較"]
[]
[]
[null,"MONTH",null,null,null,"3月",null,null,"2月",null,null,"1月",null,null,"12月",null,null,"11月",null,null,"10月",null,null,"9月",null,null,"8月",null,null,"7月",null,null,"6月",null,null,"5月",null,null,"4月",null,null,"3月",null,"增/(減)"]
[null,null,"附註",null,null,"HK$'000",null,null,"HK$'000",null,null,"HK$'000",null,null,"HK$'000",null,null,"HK$'000",null,null,"HK$'000",null,null,"HK$'000",null,null,"HK$'000",null,null,"HK$'000",null,null,"HK$'000",null,null,"HK$'000",null,null,"HK$'000",null,null,"HK$'000",null,"HK$'000","%"]
[]
[null,"Private income A",null,null,{"$f":"VLOOKUP($B8,'Exp_private (YTD)'!$B$8:$AH$30,15,FALSE)","v":0},{"$f":"ROUND(E8/1000,0)","v":0},null,{"$f":"VLOOKUP($B8,'Exp_private (YTD)'!$B$8:$AH$30,14,FALSE)","v":0},{"$f":"ROUND(H8/1000,0)","v":0},null,{"$f":"VLOOKUP($B8,'Exp_private (YTD)'!$B$8:$AH$30,13,FALSE)","v":0},{"$f":"ROUND(K8/1000,0)","v":0},null,{"$f":"VLOOKUP($B8,'Exp_private (YTD)'!$B$8:$AH$30,12,FALSE)","v":990000},{"$f":"ROUND(N8/1000,0)","v":990},null,{"$f":"VLOOKUP($B8,'Exp_private (YTD)'!$B$8:$AH$30,11,FALSE)","v":1200000},{"$f":"ROUND(Q8/1000,0)","v":1200},null,{"$f":"VLOOKUP($B8,'Exp_private (YTD)'!$B$8:$AH$30,10,FALSE)","v":1000},{"$f":"ROUND(T8/1000,0)","v":1},null,{"$f":"VLOOKUP($B8,'Exp_private (YTD)'!$B$8:$AH$30,9,FALSE)","v":1000},{"$f":"ROUND(W8/1000,0)","v":1},null,{"$f":"VLOOKUP($B8,'Exp_private (YTD)'!$B$8:$AH$30,8,FALSE)","v":1000},{"$f":"ROUND(Z8/1000,0)","v":1},null,{"$f":"VLOOKUP($B8,'Exp_private (YTD)'!$B$8:$AH$30,7,FALSE)","v":1000},{"$f":"ROUND(AC8/1000,0)","v":1},null,{"$f":"VLOOKUP($B8,'Exp_private (YTD)'!$B$8:$AH$30,6,FALSE)","v":1000},{"$f":"ROUND(AF8/1000,0)","v":1},null,{"$f":"VLOOKUP($B8,'Exp_private (YTD)'!$B$8:$AH$30,5,FALSE)","v":1000},{"$f":"ROUND(AI8/1000,0)","v":1},null,{"$f":"VLOOKUP($B8,'Exp_private (YTD)'!$B$8:$AH$30,4,FALSE)","v":1000},{"$f":"ROUND(AL8/1000,0)","v":1},null,{"$f":"VLOOKUP(B8,'Exp_private (YTD)'!$B$8:$AH$30,30,FALSE)","v":1000},{"$f":"ROUND(AO8/1000,0)","v":1},null,{"$f":"O8-R8","v":-210},{"$f":"IF(R8=0,IF(O8=0,\"N/A\",\"100%\"),AR8/R8)","v":-0.17499999999999999}]
[null,"Private income B",null,null,{"$f":"VLOOKUP($B9,'Exp_private (YTD)'!$B$8:$AH$30,15,FALSE)","v":0},{"$f":"ROUND(E9/1000,0)","v":0},null,{"$f":"VLOOKUP($B9,'Exp_private (YTD)'!$B$8:$AH$30,14,FALSE)","v":0},{"$f":"ROUND(H9/1000,0)","v":0},null,{"$f":"VLOOKUP($B9,'Exp_private (YTD)'!$B$8:$AH$30,13,FALSE)","v":0},{"$f":"ROUND(K9/1000,0)","v":0},null,{"$f":"VLOOKUP($B9,'Exp_private (YTD)'!$B$8:$AH$30,12,FALSE)","v":1000},{"$f":"ROUND(N9/1000,0)","v":1},null,{"$f":"VLOOKUP($B9,'Exp_private (YTD)'!$B$8:$AH$30,11,FALSE)","v":1000},{"$f":"ROUND(Q9/1000,0)","v":1},null,{"$f":"VLOOKUP($B9,'Exp_private (YTD)'!$B$8:$AH$30,10,FALSE)","v":1000},{"$f":"ROUND(T9/1000,0)","v":1},null,{"$f":"VLOOKUP($B9,'Exp_private (YTD)'!$B$8:$AH$30,9,FALSE)","v":1000},{"$f":"ROUND(W9/1000,0)","v":1},null,{"$f":"VLOOKUP($B9,'Exp_private (YTD)'!$B$8:$AH$30,8,FALSE)","v":1000},{"$f":"ROUND(Z9/1000,0)","v":1},null,{"$f":"VLOOKUP($B9,'Exp_private (YTD)'!$B$8:$AH$30,7,FALSE)","v":1000},{"$f":"ROUND(AC9/1000,0)","v":1},null,{"$f":"VLOOKUP($B9,'Exp_private (YTD)'!$B$8:$AH$30,6,FALSE)","v":1000},{"$f":"ROUND(AF9/1000,0)","v":1},null,{"$f":"VLOOKUP($B9,'Exp_private (YTD)'!$B$8:$AH$30,5,FALSE)","v":1000},{"$f":"ROUND(AI9/1000,0)","v":1},null,{"$f":"VLOOKUP($B9,'Exp_private (YTD)'!$B$8:$AH$30,4,FALSE)","v":1000},{"$f":"ROUND(AL9/1000,0)","v":1},null,{"$f":"VLOOKUP(B9,'Exp_private (YTD)'!$B$8:$AH$30,30,FALSE)","v":1000},{"$f":"ROUND(AO9/1000,0)","v":1},null,0,0]
[null,"Private income C",null,null,{"$f":"VLOOKUP($B10,'Exp_private (YTD)'!$B$8:$AH$30,15,FALSE)","v":0},{"$f":"ROUND(E10/1000,0)","v":0},null,{"$f":"VLOOKUP($B10,'Exp_private (YTD)'!$B$8:$AH$30,14,FALSE)","v":0},{"$f":"ROUND(H10/1000,0)","v":0},null,{"$f":"VLOOKUP($B10,'Exp_private (YTD)'!$B$8:$AH$30,13,FALSE)","v":0},{"$f":"ROUND(K10/1000,0)","v":0},null,{"$f":"VLOOKUP($B10,'Exp_private (YTD)'!$B$8:$AH$30,12,FALSE)","v":1000},{"$f":"ROUND(N10/1000,0)","v":1},null,{"$f":"VLOOKUP($B10,'Exp_private (YTD)'!$B$8:$AH$30,11,FALSE)","v":1000},{"$f":"ROUND(Q10/1000,0)","v":1},null,{"$f":"VLOOKUP($B10,'Exp_private (YTD)'!$B$8:$AH$30,10,FALSE)","v":1000},{"$f":"ROUND(T10/1000,0)","v":1},null,{"$f":"VLOOKUP($B10,'Exp_private (YTD)'!$B$8:$AH$30,9,FALSE)","v":1000},{"$f":"ROUND(W10/1000,0)","v":1},null,{"$f":"VLOOKUP($B10,'Exp_private (YTD)'!$B$8:$AH$30,8,FALSE)","v":1000},{"$f":"ROUND(Z10/1000,0)","v":1},null,{"$f":"VLOOKUP($B10,'Exp_private (YTD)'!$B$8:$AH$30,7,FALSE)","v":1000},{"$f":"ROUND(AC10/1000,0)","v":1},null,{"$f":"VLOOKUP($B10,'Exp_private (YTD)'!$B$8:$AH$30,6,FALSE)","v":1000},{"$f":"ROUND(AF10/1000,0)","v":1},null,{"$f":"VLOOKUP($B10,'Exp_private (YTD)'!$B$8:$AH$30,5,FALSE)","v":1000},{"$f":"ROUND(AI10/1000,0)","v":1},null,{"$f":"VLOOKUP($B10,'Exp_private (YTD)'!$B$8:$AH$30,4,FALSE)","v":1000},{"$f":"ROUND(AL10/1000,0)","v":1},null,{"$f":"VLOOKUP(B10,'Exp_private (YTD)'!$B$8:$AH$30,30,FALSE)","v":1000},{"$f":"ROUND(AO10/1000,0)","v":1},null,0,0]
{"$rows_left_out":22}